PhCHCN anion

Reaction thermochemistry data

Data compiled by: John E. Bartmess

Individual Reactions

C8H6N- + Hydrogen cation = Benzyl nitrile

By formula: C8H6N- + H+ = C8H7N

Quantity Value Units Method Reference Comment
Δr350.7 ± 2.3kcal/molG+TSFujio, McIver, et al., 1981gas phase; value altered from reference due to change in acidity scale
Δr351.5 ± 3.2kcal/molG+TSCumming and Kebarle, 1978gas phase
Quantity Value Units Method Reference Comment
Δr344.1 ± 2.0kcal/molIMREFujio, McIver, et al., 1981gas phase; value altered from reference due to change in acidity scale
Δr344.9 ± 2.0kcal/molIMRECumming and Kebarle, 1978gas phase

References

Fujio, McIver, et al., 1981
Fujio, M.; McIver, R.T., Jr.; Taft, R.W., Effects on the acidities of phenols from specific substituent-solvent interactions. Inherent substituent parameters from gas phase acidities, J. Am. Chem. Soc., 1981, 103, 4017. [all data]

Cumming and Kebarle, 1978
Cumming, J.B.; Kebarle, P., Summary of gas phase measurements involving acids AH. Entropy changes in proton transfer reactions involving negative ions. Bond dissociation energies D(A-H) and electron affinities EA(A), Can. J. Chem., 1978, 56, 1. [all data]