FO anion

Reaction thermochemistry data

Data compiled by: John E. Bartmess

Individual Reactions

FO- + Hydrogen cation = HypoFluorous acid

By formula: FO- + H+ = HFO

Quantity Value Units Method Reference Comment
Δr1517. ± 14.kJ/molAcidGilles, Polak, et al., 1992gas phase
Quantity Value Units Method Reference Comment
Δr1490. ± 15.kJ/molH-TSGilles, Polak, et al., 1992gas phase

References

Gilles, Polak, et al., 1992
Gilles, M.K.; Polak, M.L.; Lineberger, W.C., Photoelectron Spectroscopy of the Halogen Oxide Anions FO-, ClO-, BrO-, IO-, OClO-, and OIO-, J. Chem. Phys., 1992, 96, 11, 8012, https://doi.org/10.1063/1.462352 . [all data]