Me2CCN anion

Gas phase ion energetics data

Data compiled by: John E. Bartmess

Protonation reactions

C4H6N- + Hydrogen cation = Isobutyronitrile

By formula: C4H6N- + H+ = C4H7N

Quantity Value Units Method Reference Comment
Δr375.1 ± 2.2kcal/molG+TSBartmess, Scott, et al., 1979gas phase; value altered from reference due to change in acidity scale
Quantity Value Units Method Reference Comment
Δr367.9 ± 2.0kcal/molIMREBartmess, Scott, et al., 1979gas phase; value altered from reference due to change in acidity scale

Reaction thermochemistry data

Data compiled by: John E. Bartmess

Individual Reactions

C4H6N- + Hydrogen cation = Isobutyronitrile

By formula: C4H6N- + H+ = C4H7N

Quantity Value Units Method Reference Comment
Δr375.1 ± 2.2kcal/molG+TSBartmess, Scott, et al., 1979gas phase; value altered from reference due to change in acidity scale
Quantity Value Units Method Reference Comment
Δr367.9 ± 2.0kcal/molIMREBartmess, Scott, et al., 1979gas phase; value altered from reference due to change in acidity scale

References

Bartmess, Scott, et al., 1979
Bartmess, J.E.; Scott, J.A.; McIver, R.T., Jr., The gas phase acidity scale from methanol to phenol, J. Am. Chem. Soc., 1979, 101, 6047. [all data]