1-CN-cyclopropanide anion

Gas phase ion energetics data

Data compiled by: John E. Bartmess

Protonation reactions

C4H4N- + Hydrogen cation = Cyclopropanecarbonitrile

By formula: C4H4N- + H+ = C4H5N

Quantity Value Units Method Reference Comment
Δr375.4 ± 2.2kcal/molG+TSBartmess, Scott, et al., 1979gas phase; Acid: cyanocyclopropane; value altered from reference due to change in acidity scale
Quantity Value Units Method Reference Comment
Δr367.8 ± 2.0kcal/molIMREBartmess, Scott, et al., 1979gas phase; Acid: cyanocyclopropane; value altered from reference due to change in acidity scale

Reaction thermochemistry data

Data compiled by: John E. Bartmess

Individual Reactions

C4H4N- + Hydrogen cation = Cyclopropanecarbonitrile

By formula: C4H4N- + H+ = C4H5N

Quantity Value Units Method Reference Comment
Δr375.4 ± 2.2kcal/molG+TSBartmess, Scott, et al., 1979gas phase; Acid: cyanocyclopropane; value altered from reference due to change in acidity scale
Quantity Value Units Method Reference Comment
Δr367.8 ± 2.0kcal/molIMREBartmess, Scott, et al., 1979gas phase; Acid: cyanocyclopropane; value altered from reference due to change in acidity scale

References

Bartmess, Scott, et al., 1979
Bartmess, J.E.; Scott, J.A.; McIver, R.T., Jr., The gas phase acidity scale from methanol to phenol, J. Am. Chem. Soc., 1979, 101, 6047. [all data]