Pb3C6F5 anion

Gas phase ion energetics data

Data compiled by: John E. Bartmess

Electron affinity of neutral species

EAneutral (eV) Method Reference Comment
2.63 ± 0.10LPESSun, Sun, et al., 2009

References

Sun, Sun, et al., 2009
Sun, Z.; Sun, S.T.; Liu, H.T.; Zhu, Q.H.; Gao, Z.; Tang, Z.C., Photoelectron Spectroscopic and Theoretical Studies of MmC6F5 Anionic Complexes (M = Ph and Bi; m=1-4), J. Phys. Chem. A, 2009, 113, 28, 8045-8054, https://doi.org/10.1021/jp8099626 . [all data]