Al8Co anion

Gas phase ion energetics data

Data compiled by: John E. Bartmess

Electron affinity of neutral species

EAneutral (eV) Reference Comment
2.00 ± 0.20Pramann, Nakajima, et al., 2001Vertical Detachment Energy: 2.67±0.13 eV

References

Pramann, Nakajima, et al., 2001
Pramann, A.; Nakajima, A.; Kaya, K., Photoelectron spectroscopy of bimetallic aluminum cobalt cluster anions: Comparison of electronic structure and hydrogen chemisorption rates, J. Chem. Phys., 2001, 115, 12, 5404-5410, https://doi.org/10.1063/1.1394944 . [all data]