Ag3S4 anion

Gas phase ion energetics data

Data compiled by: John E. Bartmess

Electron affinity of neutral species

EAneutral (eV) Method Reference Comment
3.07 ± 0.49LPESNakajima, Kawamata, et al., 1997Vertical Detachment Energy: 3.62±0.09 eV

References

Nakajima, Kawamata, et al., 1997
Nakajima, A.; Kawamata, H.; Hayase, T.; Negishi, Y.; Kaya, K., Photoelectron spectroscopy of transition metal-sulfur cluster anions, Z. Phys. D, 1997, 40, 1, 17-21, https://doi.org/10.1007/s004600050148 . [all data]