AgS2 anion

Gas phase ion energetics data

Data compiled by: John E. Bartmess

Electron affinity of neutral species

EAneutral (eV) Method Reference Comment
1.40 ± 0.10LPESNakajima, Kawamata, et al., 1997Vertical Detachment Energy: 1.90±0.10 eV

References

Nakajima, Kawamata, et al., 1997
Nakajima, A.; Kawamata, H.; Hayase, T.; Negishi, Y.; Kaya, K., Photoelectron spectroscopy of transition metal-sulfur cluster anions, Z. Phys. D, 1997, 40, 1, 17-21, https://doi.org/10.1007/s004600050148 . [all data]