(anthracene)10 radical anion

Gas phase ion energetics data

Data compiled by: John E. Bartmess

Electron affinity of neutral species

EAneutral (eV) Method Reference Comment
1.330 ± 0.020LPESAndo, Mitsui, et al., 2007Stated electron affinity is the Vertical Detachment Energy

References

Ando, Mitsui, et al., 2007
Ando, N.; Mitsui, M.; Nakajima, A., Comprehensive photoelectron spectroscopic study of anionic clusters of anthracene and its alkyl derivatives: Electronic structures bridging molecules to bulk, J. Chem. Phys., 2007, 127, 23, 234305, https://doi.org/10.1063/1.2805185 . [all data]