C60Au2 radical anion

Gas phase ion energetics data

Data compiled by: John E. Bartmess

Electron affinity of neutral species

EAneutral (eV) Method Reference Comment
2.59 ± 0.10LPESPalpant, Negishi, et al., 2001Vertical Detachment Energy: 2.90±0.05 eV

References

Palpant, Negishi, et al., 2001
Palpant, B.; Negishi, Y.; Sanekata, M.; Miyajima, K.; Nagao, S.; Judai, K.; Rayner, D.M.; Simard, B.; Hackett, P.A.; Nakajima, A.; Kaya, K., Electronic and geometric properties of exohedral sodium- and gold-fullerenes, J. Chem. Phys., 2001, 114, 19, 8459-8466, https://doi.org/10.1063/1.1366641 . [all data]