Mn5S4 radical anion

Gas phase ion energetics data

Data compiled by: John E. Bartmess

Electron affinity of neutral species

EAneutral (eV) Method Reference Comment
2.07 ± 0.24LPESZhang, Kawamata, et al., 1996Vertical Detachment Energy: 2.40±0.09 eV

References

Zhang, Kawamata, et al., 1996
Zhang, N.; Kawamata, H.; Nakajima, A.; Kaya, K., Photoelectron spectroscopy of manganese-sulfur cluster anions, J. Chem. Phys., 1996, 104, 1, 36-41, https://doi.org/10.1063/1.470873 . [all data]