CH2=C(C6H4-mOMe)O anion

Reaction thermochemistry data

Data compiled by: John E. Bartmess

Individual Reactions

C9H9O2- + Hydrogen cation = 3-Methoxyacetophenone

By formula: C9H9O2- + H+ = C9H10O2

Quantity Value Units Method Reference Comment
Δr360.7 ± 2.1kcal/molG+TSBartmess, Scott, et al., 1979gas phase; value altered from reference due to change in acidity scale
Quantity Value Units Method Reference Comment
Δr353.9 ± 2.0kcal/molIMREBartmess, Scott, et al., 1979gas phase; value altered from reference due to change in acidity scale

References

Bartmess, Scott, et al., 1979
Bartmess, J.E.; Scott, J.A.; McIver, R.T., Jr., The gas phase acidity scale from methanol to phenol, J. Am. Chem. Soc., 1979, 101, 6047. [all data]