C60Ge2 radical anion

Gas phase ion energetics data

Data compiled by: John E. Bartmess

Electron affinity of neutral species

EAneutral (eV) Method Reference Comment
2.60 ± 0.10LPESOhara, Nakamura, et al., 2002Vertical Detachment Energy: 2.70±0.05 eV

References

Ohara, Nakamura, et al., 2002
Ohara, M.; Nakamura, Y.; Negishi, Y.; Miyajima, K.; Nakajima, A.; Kaya, K., Behavior of silicon and germanium clusters on a C-60 fullerene, J. Phys. Chem. A, 2002, 106, 18, 4498-4501, https://doi.org/10.1021/jp013420z . [all data]