CF2=C(CHF2)O anion

Reaction thermochemistry data

Data compiled by: John E. Bartmess

Individual Reactions

C3HF4O- + Hydrogen cation = 1,1,3,3-tetrafluoroacetone

By formula: C3HF4O- + H+ = C3H2F4O

Quantity Value Units Method Reference Comment
Δr1429. ± 23.kJ/molG+TSFarid and McMahon, 1980gas phase; Between HCO2H, FCH2CO2H; value altered from reference due to change in acidity scale
Quantity Value Units Method Reference Comment
Δr1401. ± 23.kJ/molIMRBFarid and McMahon, 1980gas phase; Between HCO2H, FCH2CO2H; value altered from reference due to change in acidity scale

Gas phase ion energetics data

Data compiled by: John E. Bartmess

Protonation reactions

C3HF4O- + Hydrogen cation = 1,1,3,3-tetrafluoroacetone

By formula: C3HF4O- + H+ = C3H2F4O

Quantity Value Units Method Reference Comment
Δr1429. ± 23.kJ/molG+TSFarid and McMahon, 1980gas phase; Between HCO2H, FCH2CO2H; value altered from reference due to change in acidity scale
Quantity Value Units Method Reference Comment
Δr1401. ± 23.kJ/molIMRBFarid and McMahon, 1980gas phase; Between HCO2H, FCH2CO2H; value altered from reference due to change in acidity scale

References

Farid and McMahon, 1980
Farid, R.; McMahon, T.B., The gas phase acidities of fluorinated acetones. An ICR investigation of the role of fluorine substituents in the stabilization of planar carbanions, Can. J. Chem., 1980, 58, 2307. [all data]