TiSi16F anion

Gas phase ion energetics data

Data compiled by: John E. Bartmess

Electron affinity of neutral species

EAneutral (eV) Method Reference Comment
3.23 ± 0.32LPESKoyasu, Atobe, et al., 2007

References

Koyasu, Atobe, et al., 2007
Koyasu, K.; Atobe, J.; Akutsu, M.; Mitsui, M.; Nakajima, A., Electronic and Geometric Stabilities of Clusters with Transition Metal Encapsulated by Silicon, J. Phys. Chem. A, 2007, 111, 1, 42-49., https://doi.org/10.1021/jp066757f . [all data]