TaSi16 anion

Gas phase ion energetics data

Data compiled by: John E. Bartmess

Electron affinity of neutral species

EAneutral (eV) Method Reference Comment
3.370 ± 0.090LPESKoyasu, Atobe, et al., 2007
3.40 ± 0.10LPESKoyasu, Atobe, et al., 2008

References

Koyasu, Atobe, et al., 2007
Koyasu, K.; Atobe, J.; Akutsu, M.; Mitsui, M.; Nakajima, A., Electronic and Geometric Stabilities of Clusters with Transition Metal Encapsulated by Silicon, J. Phys. Chem. A, 2007, 111, 1, 42-49., https://doi.org/10.1021/jp066757f . [all data]

Koyasu, Atobe, et al., 2008
Koyasu, K.; Atobe, J.; Furuse, S.; Nakajima, A., Anion photoelectron spectroscopy of transition metal- and lanthanide metal-silicon clusters: MSin- (n=6-20), J. Chem. Phys., 2008, 129, 21, 214301, https://doi.org/10.1063/1.3023080 . [all data]