Me2C=C(iPr)O anion

Reaction thermochemistry data

Data compiled by: John E. Bartmess

Individual Reactions

C7H13O- + Hydrogen cation = 3-Pentanone, 2,4-dimethyl-

By formula: C7H13O- + H+ = C7H14O

Quantity Value Units Method Reference Comment
Δr364.8 ± 2.3kcal/molD-EAZimmerman, Reed, et al., 1977gas phase
Quantity Value Units Method Reference Comment
Δr357.6 ± 2.6kcal/molH-TSZimmerman, Reed, et al., 1977gas phase

References

Zimmerman, Reed, et al., 1977
Zimmerman, A.H.; Reed, K.J.; Brauman, J.I., Photodetachment of electrons from enolate anions. Gas phase electron affinities of enolate radicals, J. Am. Chem. Soc., 1977, 99, 7203. [all data]