MoSi13 anion

Gas phase ion energetics data

Data compiled by: John E. Bartmess

Electron affinity of neutral species

EAneutral (eV) Method Reference Comment
2.99 ± 0.19LPESOhara, Koyasu, et al., 2003

References

Ohara, Koyasu, et al., 2003
Ohara, M.; Koyasu, K.; Nakajima, A.; Kaya, K., Geometric and Electronic Structures of metal (M)-Doped Silicon Clusters (M=Ti, Hf, Mo, and W), Chem. Phys. Lett., 2003, 371, 3-4, 490-497., https://doi.org/10.1016/S0009-2614(03)00299-9 . [all data]