EtCH=C(nPr)O anion

Reaction thermochemistry data

Data compiled by: John E. Bartmess

Individual Reactions

C7H13O- + Hydrogen cation = 4-Heptanone

By formula: C7H13O- + H+ = C7H14O

Quantity Value Units Method Reference Comment
Δr1518. ± 10.kJ/molD-EAZimmerman, Reed, et al., 1977gas phase
Quantity Value Units Method Reference Comment
Δr1488. ± 11.kJ/molH-TSZimmerman, Reed, et al., 1977gas phase

Gas phase ion energetics data

Data compiled by: John E. Bartmess

Electron affinity of neutral species

EAneutral (eV) Method Reference Comment
1.722 ± 0.056PDZimmerman, Reed, et al., 1977

Protonation reactions

C7H13O- + Hydrogen cation = 4-Heptanone

By formula: C7H13O- + H+ = C7H14O

Quantity Value Units Method Reference Comment
Δr1518. ± 10.kJ/molD-EAZimmerman, Reed, et al., 1977gas phase
Quantity Value Units Method Reference Comment
Δr1488. ± 11.kJ/molH-TSZimmerman, Reed, et al., 1977gas phase

References

Zimmerman, Reed, et al., 1977
Zimmerman, A.H.; Reed, K.J.; Brauman, J.I., Photodetachment of electrons from enolate anions. Gas phase electron affinities of enolate radicals, J. Am. Chem. Soc., 1977, 99, 7203. [all data]