TiSi17 anion

Gas phase ion energetics data

Data compiled by: John E. Bartmess

Electron affinity of neutral species

EAneutral (eV) Method Reference Comment
2.47 ± 0.13LPESOhara, Koyasu, et al., 2003
2.80 ± 0.10LPESKoyasu, Atobe, et al., 2008

References

Ohara, Koyasu, et al., 2003
Ohara, M.; Koyasu, K.; Nakajima, A.; Kaya, K., Geometric and Electronic Structures of metal (M)-Doped Silicon Clusters (M=Ti, Hf, Mo, and W), Chem. Phys. Lett., 2003, 371, 3-4, 490-497., https://doi.org/10.1016/S0009-2614(03)00299-9 . [all data]

Koyasu, Atobe, et al., 2008
Koyasu, K.; Atobe, J.; Furuse, S.; Nakajima, A., Anion photoelectron spectroscopy of transition metal- and lanthanide metal-silicon clusters: MSin- (n=6-20), J. Chem. Phys., 2008, 129, 21, 214301, https://doi.org/10.1063/1.3023080 . [all data]