V@Sn12 anion

Gas phase ion energetics data

Data compiled by: John E. Bartmess

Electron affinity of neutral species

EAneutral (eV) Method Reference Comment
3.030 ± 0.040LPESCui, Huang, et al., 2007Vertical Detachment Energy: 3.17±0.03 eV

References

Cui, Huang, et al., 2007
Cui, L.-F.; Huang, X.; Wang, L.-M.; Li, J.; Wang, L.-S., Endohedral Stannaspheranes M@Sn12-: A Rich Class of Stable Molecualr Cage Clusters, Angew. Chem. Int. Ed., 2007, 46, 5, 742-745, https://doi.org/10.1002/anie.200603226 . [all data]