H2O..PhNH anion
- Formula: C6H8NO-
- Molecular weight: 110.1344

Gas phase ion energetics data

Data compiled by: John E. Bartmess
Electron affinity of neutral species
EAneutral (eV) | Method | Reference | Comment |
---|---|---|---|
2.20 ± 0.10 | LPES | Wolf, Shapira, et al., 2008 | Stated electron affinity is the Vertical Detachment Energy |

References

Wolf, Shapira, et al., 2008
Wolf, I.; Shapira, A.; Giniger, R.; Miller, Y.; Gerber, R.B.; Cheshnovsky, O.,
Critical size for intracluster proton transfer from water to an anion,
Angew. Chem. Intl. Ed. Engl., 2008, 47, 33, 6272-6274, https://doi.org/10.1002/anie.200800542
. [all data]