nitrobenzene..I anion

Reaction thermochemistry data

Data compiled by: John E. Bartmess

Individual Reactions

Iodide = C6H5INO2-

By formula: I- = C6H5INO2-

Quantity Value Units Method Reference Comment
Δr46.4 ± 8.4kJ/molN/APiani, Becucci, et al., 2008gas phase; Stated electron affinity is the Vertical Detachment Energy

Gas phase ion energetics data

Data compiled by: John E. Bartmess

Electron affinity of neutral species

EAneutral (eV) Reference Comment
3.540 ± 0.040Piani, Becucci, et al., 2008Stated electron affinity is the Vertical Detachment Energy

Ion clustering data

Data compiled by: John E. Bartmess

Clustering reactions

Iodide = C6H5INO2-

By formula: I- = C6H5INO2-

Quantity Value Units Method Reference Comment
Δr46.4 ± 8.4kJ/molN/APiani, Becucci, et al., 2008gas phase; Stated electron affinity is the Vertical Detachment Energy

References

Piani, Becucci, et al., 2008
Piani, G.; Becucci, M.; Bowen, M.S.; Oakman, J.; Hu, Q.; Continetti, R.E., Photodetachment and dissociation dynamics of microsolvated iodide clusters, Phys. Scripta, 2008, 78, 5, 058110, https://doi.org/10.1088/0031-8949/78/05/058110 . [all data]