CF2=C(Me)O anion

Gas phase ion energetics data

Data compiled by: John E. Bartmess

Electron affinity of neutral species

EAneutral (eV) Method Reference Comment
>1.0 ± 0.30EIAEThynne, 1972From CF3COMe. G3MP2B3 calculations indicate an EA of ca. 1.7 eV

References

Thynne, 1972
Thynne, J.C.J., Negative Ion Studies with a Time-of-Flight Mass Spectrometer., Dyn. Mass Spectrom., 1972, 3, 67. [all data]