(benzene)2Fe4 anion

Gas phase ion energetics data

Data compiled by: John E. Bartmess

Electron affinity of neutral species

EAneutral (eV) Method Reference Comment
1.30 ± 0.10LPESZheng, Eustis, et al., 2008

References

Zheng, Eustis, et al., 2008
Zheng, W.J.; Eustis, S.N.; Li, X.; Nilles, J.M.; Thomas, O.C.; Bowen, K.H.; Kandalam, A.K., Photoelectron spectroscopic study of iron-benzene cluster anions, Chem. Phys. Lett., 2008, 462, 1-3, 35-39, https://doi.org/10.1016/j.cplett.2008.07.052 . [all data]