EtNO2 radical anion

Gas phase ion energetics data

Data compiled by: John E. Bartmess

Electron affinity of neutral species

EAneutral (eV) Method Reference Comment
0.1910 ± 0.0060N/AAdams and Weber, 2011
0.30 ± 0.20LPESStokes, Bowen, et al., 2008Vertical Detachment Energy: 0.92±0.10 eV

References

Adams and Weber, 2011
Adams, C.L.; Weber, J.M., Photoelectron imaging spectroscopy of nitroethane anions, J. Chem. Phys., 2011, 134, 24, 244301, https://doi.org/10.1063/1.3602467 . [all data]

Stokes, Bowen, et al., 2008
Stokes, S.T.; Bowen, K.H.; Sommerfeld, T.; Ard, S.; Mirsaleh-Kohan, N.; Steill, J.D.; Compton, R.N., Negative ions of nitroethane and its clusters, J. Chem. Phys., 2008, 129, 6, 064308, https://doi.org/10.1063/1.2965534 . [all data]