cyclopentanone enolate anion

Reaction thermochemistry data

Data compiled by: John E. Bartmess

Individual Reactions

C5H7O- + Hydrogen cation = Cyclopentanone

By formula: C5H7O- + H+ = C5H8O

Quantity Value Units Method Reference Comment
Δr1540. ± 18.kJ/molG+TSBrickhouse and Squires, 1988gas phase
Quantity Value Units Method Reference Comment
Δr1507. ± 17.kJ/molIMRBBrickhouse and Squires, 1988gas phase

References

Brickhouse and Squires, 1988
Brickhouse, M.D.; Squires, R.R., Gas Phase Bronsted vs. Lewis Acid-Base Reactions of 6,6-Dimethylfulvene. A Sensitive Probe of the Electronic Structures of Organic Anions, J. Am. Chem. Soc., 1988, 110, 9, 2706, https://doi.org/10.1021/ja00217a002 . [all data]