Fe(coronene)2 radical anion

Gas phase ion energetics data

Data compiled by: John E. Bartmess

Electron affinity of neutral species

EAneutral (eV) Method Reference Comment
1.500 ± 0.050LPESLi, Eustis, et al., 2008Vertical Detachment Energy: 1.71±0.05 eV

References

Li, Eustis, et al., 2008
Li, X.; Eustis, S.; Bowen, K.H.; Kandalam, A.K.; Jena, P., Photoelectron spectroscopic and theoretical studies of Fe-m(-)(coronene)(n) (m=1,2, n=1,2) complexes, J. Chem. Phys., 2008, 129, 7, 074313, https://doi.org/10.1063/1.2968609 . [all data]