MeCOCH2F..Cl anion

Gas phase thermochemistry data

Data compiled by: John E. Bartmess

Quantity Value Units Method Reference Comment
Δfgas-693.83kJ/molTherBofdanov and McMahon, 2002

Reaction thermochemistry data

Data compiled by: John E. Bartmess

Individual Reactions

Chlorine anion + 2-Propanone, 1-fluoro- = C3H5ClFO-

By formula: Cl- + C3H5FO = C3H5ClFO-

Quantity Value Units Method Reference Comment
Δr77.0 ± 4.2kJ/molTDAsBofdanov and McMahon, 2002gas phase
Quantity Value Units Method Reference Comment
Δr46.4 ± 4.2kJ/molTDAsBofdanov and McMahon, 2002gas phase

Ion clustering data

Data compiled by: John E. Bartmess

Clustering reactions

Chlorine anion + 2-Propanone, 1-fluoro- = C3H5ClFO-

By formula: Cl- + C3H5FO = C3H5ClFO-

Quantity Value Units Method Reference Comment
Δr77.0 ± 4.2kJ/molTDAsBofdanov and McMahon, 2002gas phase
Quantity Value Units Method Reference Comment
Δr46.4 ± 4.2kJ/molTDAsBofdanov and McMahon, 2002gas phase

References

Bofdanov and McMahon, 2002
Bofdanov, B.; McMahon, T.B., Structures, Thermochemistry, and Infrared Spectra of Chloride Ion-Fluorinated Acetone Complexes and Neutral Fluorinated Acetones in the Gas Phase: Experiment and Theory, Int. J. Mass Spectrom., 2002, 219, 3, 593-613, https://doi.org/10.1016/S1387-3806(02)00745-5 . [all data]