CHF=C(Me)O anion

Gas phase ion energetics data

Data compiled by: John E. Bartmess

Protonation reactions

C3H4FO- + Hydrogen cation = 2-Propanone, 1-fluoro-

By formula: C3H4FO- + H+ = C3H5FO

Quantity Value Units Method Reference Comment
Δr357.6 ± 3.6kcal/molG+TSFarid and McMahon, 1980gas phase; Between pyrrole, MeNO2; value altered from reference due to change in acidity scale
Quantity Value Units Method Reference Comment
Δr350.2 ± 3.5kcal/molIMRBFarid and McMahon, 1980gas phase; Between pyrrole, MeNO2; value altered from reference due to change in acidity scale

References

Farid and McMahon, 1980
Farid, R.; McMahon, T.B., The gas phase acidities of fluorinated acetones. An ICR investigation of the role of fluorine substituents in the stabilization of planar carbanions, Can. J. Chem., 1980, 58, 2307. [all data]