EuSi8 anion

Gas phase ion energetics data

Data compiled by: John E. Bartmess

Electron affinity of neutral species

EAneutral (eV) Method Reference Comment
1.750 ± 0.050LPESGrubisic, Wang, et al., 2008

References

Grubisic, Wang, et al., 2008
Grubisic, A.; Wang, H.P.; Ko, Y.J.; Bowen, K.H., Photoelectron spectroscopy of europium-silicon cluster anions, EuSin- (3 = n = 17), J. Chem. Phys., 2008, 129, 5, 054302, https://doi.org/10.1063/1.2963500 . [all data]