MeCH=C(Me)O anion

Gas phase ion energetics data

Data compiled by: John E. Bartmess

Electron affinity of neutral species

EAneutral (eV) Method Reference Comment
1.64 ± 0.19D-EACumming and Kebarle, 1978
1.490 ± 0.020LPESAlconcel, Deyerl, et al., 2001
1.674 ± 0.052PDZimmerman, Reed, et al., 1977

Protonation reactions

C4H7O- + Hydrogen cation = 2-Butanone

By formula: C4H7O- + H+ = C4H8O

Quantity Value Units Method Reference Comment
Δr368.1 ± 2.9kcal/molG+TSCumming and Kebarle, 1978gas phase
Quantity Value Units Method Reference Comment
Δr361.3 ± 2.0kcal/molIMRECumming and Kebarle, 1978gas phase

References

Cumming and Kebarle, 1978
Cumming, J.B.; Kebarle, P., Summary of gas phase measurements involving acids AH. Entropy changes in proton transfer reactions involving negative ions. Bond dissociation energies D(A-H) and electron affinities EA(A), Can. J. Chem., 1978, 56, 1. [all data]

Alconcel, Deyerl, et al., 2001
Alconcel, L.S.; Deyerl, H.J.; Continetti, R.E., Effects of alkyl substitution on the energetics of enolate anions and radicals, J. Am. Chem. Soc., 2001, 123, 50, 12675-12681, https://doi.org/10.1021/ja0120431 . [all data]

Zimmerman, Reed, et al., 1977
Zimmerman, A.H.; Reed, K.J.; Brauman, J.I., Photodetachment of electrons from enolate anions. Gas phase electron affinities of enolate radicals, J. Am. Chem. Soc., 1977, 99, 7203. [all data]