CH2=C(Et)O anion

Gas phase ion energetics data

Data compiled by: John E. Bartmess

Electron affinity of neutral species

EAneutral (eV) Method Reference Comment
1.760 ± 0.020LPESAlconcel, Deyerl, et al., 2001
1.84 ± 0.15D-EAChyall, Brickhouse, et al., 1994Primary and secondary sites are of equal acidity by equilibration. Acidity from Zimmerman, Reed, et al., 1977
1.752 ± 0.056PDZimmerman, Reed, et al., 1977

Protonation reactions

C4H7O- + Hydrogen cation = 2-Butanone

By formula: C4H7O- + H+ = C4H8O

Quantity Value Units Method Reference Comment
Δr1536. ± 12.kJ/molG+TSChyall, Brickhouse, et al., 1994gas phase; Primary and secondary sites are of equal acidity by equilibration. Acidity from Zimmerman, Reed, et al., 1977
Δr1545. ± 10.kJ/molD-EAZimmerman, Reed, et al., 1977gas phase
Quantity Value Units Method Reference Comment
Δr1508. ± 11.kJ/molIMREChyall, Brickhouse, et al., 1994gas phase; Primary and secondary sites are of equal acidity by equilibration. Acidity from Zimmerman, Reed, et al., 1977
Δr1516. ± 11.kJ/molH-TSZimmerman, Reed, et al., 1977gas phase

References

Alconcel, Deyerl, et al., 2001
Alconcel, L.S.; Deyerl, H.J.; Continetti, R.E., Effects of alkyl substitution on the energetics of enolate anions and radicals, J. Am. Chem. Soc., 2001, 123, 50, 12675-12681, https://doi.org/10.1021/ja0120431 . [all data]

Chyall, Brickhouse, et al., 1994
Chyall, L.J.; Brickhouse, M.D.; Schnute, M.E.; Squires, R.R., Kinetic versus thermodynamic control in the deprotonation of unsymmetrical ketones in the gas phase, J. Am. Chem. Soc., 1994, 116, 19, 8681, https://doi.org/10.1021/ja00098a031 . [all data]

Zimmerman, Reed, et al., 1977
Zimmerman, A.H.; Reed, K.J.; Brauman, J.I., Photodetachment of electrons from enolate anions. Gas phase electron affinities of enolate radicals, J. Am. Chem. Soc., 1977, 99, 7203. [all data]