tBuCH=CHO anion

Reaction thermochemistry data

Data compiled by: John E. Bartmess

Individual Reactions

C6H11O- + Hydrogen cation = Butanal, 3,3-dimethyl-

By formula: C6H11O- + H+ = C6H12O

Quantity Value Units Method Reference Comment
Δr1509. ± 10.kJ/molD-EAZimmerman, Reed, et al., 1977gas phase
Quantity Value Units Method Reference Comment
Δr1482. ± 11.kJ/molH-TSZimmerman, Reed, et al., 1977gas phase

Gas phase ion energetics data

Data compiled by: John E. Bartmess

Electron affinity of neutral species

EAneutral (eV) Method Reference Comment
1.821 ± 0.061PDZimmerman, Reed, et al., 1977

Protonation reactions

C6H11O- + Hydrogen cation = Butanal, 3,3-dimethyl-

By formula: C6H11O- + H+ = C6H12O

Quantity Value Units Method Reference Comment
Δr360.6 ± 2.4kcal/molD-EAZimmerman, Reed, et al., 1977gas phase
Quantity Value Units Method Reference Comment
Δr354.1 ± 2.7kcal/molH-TSZimmerman, Reed, et al., 1977gas phase

References

Zimmerman, Reed, et al., 1977
Zimmerman, A.H.; Reed, K.J.; Brauman, J.I., Photodetachment of electrons from enolate anions. Gas phase electron affinities of enolate radicals, J. Am. Chem. Soc., 1977, 99, 7203. [all data]