(m-terphenyl)22 radical anion

Gas phase ion energetics data

Data compiled by: John E. Bartmess

Electron affinity of neutral species

EAneutral (eV) Method Reference Comment
1.260 ± 0.040LPESMitsui, Ando, et al., 2008Stated electron affinity is the Vertical Detachment Energy

References

Mitsui, Ando, et al., 2008
Mitsui, M.; Ando, N.; Nakajima, A., Mass spectrometry and photoelectron spectroscopy of o-, m-, and p-terphenyl cluster anions: The effect of molecular shape on molecular assembly and ion core character, J. Phys. Chem. A, 2008, 112, 25, 5628-5635, https://doi.org/10.1021/jp801159n . [all data]