EtCH=CHO anion

Reaction thermochemistry data

Data compiled by: John E. Bartmess

Individual Reactions

C4H7O- + Hydrogen cation = Butanal

By formula: C4H7O- + H+ = C4H8O

Quantity Value Units Method Reference Comment
Δr1526. ± 8.8kJ/molD-EAAlconcel, Deyerl, et al., 2001gas phase
Δr1523. ± 9.6kJ/molD-EAZimmerman, Reed, et al., 1977gas phase
Quantity Value Units Method Reference Comment
Δr1499. ± 9.6kJ/molH-TSAlconcel, Deyerl, et al., 2001gas phase
Δr1496. ± 10.kJ/molH-TSZimmerman, Reed, et al., 1977gas phase

References

Alconcel, Deyerl, et al., 2001
Alconcel, L.S.; Deyerl, H.J.; Continetti, R.E., Effects of alkyl substitution on the energetics of enolate anions and radicals, J. Am. Chem. Soc., 2001, 123, 50, 12675-12681, https://doi.org/10.1021/ja0120431 . [all data]

Zimmerman, Reed, et al., 1977
Zimmerman, A.H.; Reed, K.J.; Brauman, J.I., Photodetachment of electrons from enolate anions. Gas phase electron affinities of enolate radicals, J. Am. Chem. Soc., 1977, 99, 7203. [all data]