AsH radical anion

Gas phase thermochemistry data

Data compiled by: John E. Bartmess

Quantity Value Units Method Reference Comment
Δfgas154. ± 11.kJ/molR-EARackwitz, Feldman, et al., 1977
Δfgas<166.9kJ/molIMRBWyatt, Holtz, et al., 1974As- +AsH3 ->

Reaction thermochemistry data

Data compiled by: John E. Bartmess

Individual Reactions

HAs- + Hydrogen cation = H2As

By formula: HAs- + H+ = H2As

Quantity Value Units Method Reference Comment
Δr1499. ± 9.6kJ/molD-EARackwitz, Feldman, et al., 1977gas phase

Gas phase ion energetics data

Data compiled by: John E. Bartmess

Protonation reactions

HAs- + Hydrogen cation = H2As

By formula: HAs- + H+ = H2As

Quantity Value Units Method Reference Comment
Δr1499. ± 9.6kJ/molD-EARackwitz, Feldman, et al., 1977gas phase

References

Rackwitz, Feldman, et al., 1977
Rackwitz, R.; Feldman, D.; Kaiser, H.J.; Heincke, E., Photodetachment bei einigen zweiatomigen negativen hydridionen: BeH-, MgH-, CaH-, ZnH-, PH-, AsH-, Z. Naturforsch. A:, 1977, 32, 594. [all data]

Wyatt, Holtz, et al., 1974
Wyatt, R.H.; Holtz, D.; McMahon, T.B.; Beauchamp, J.L., Acidity, basicity, and ion-molecule reactions of arsine in the gas phase by ICR spectroscopy, Inorg. Chem., 1974, 13, 1511. [all data]