N-Me-pyridinium-2,5-diCO2 anion

Gas phase ion energetics data

Data compiled by: John E. Bartmess

Electron affinity of neutral species

EAneutral (eV) Method Reference Comment
5.020 ± 0.050LPESWang, Dacres, et al., 2003Vertical Detachment Energy:5.23±0.10 eV

References

Wang, Dacres, et al., 2003
Wang, X.B.; Dacres, J.E.; Yang, X.; Broadus, K.M.; Lis, L.; Wang, L.S.; Kass, S.R., Photodetachment of zwitterions: Probing intramolecular Coulomb repulsion and attraction in the gas phase using pyridinium dicarboxylate anions, J. Am. Chem. Soc., 2003, 125, 1, 296-304, https://doi.org/10.1021/ja028204y . [all data]