(MeOH)3..PhCOMe radical anion

Gas phase ion energetics data

Data compiled by: John E. Bartmess

Electron affinity of neutral species

EAneutral (eV) Method Reference Comment
2.740 ± 0.070LPESYagi, Maeyama, et al., 2007This vertical detachment energy value seems at least 2 eV too large. - JEB

References

Yagi, Maeyama, et al., 2007
Yagi, I.; Maeyama, T.; Fujii, A.; Mikami, N., Stepwise solvatochromism of ketyl anions in the gas phase: Photodetachment excitation spectroscopy of benzophenone and acetophenone radical anions microsolvated with methanol, J. Phys. Chem. A, 2007, 111, 31, 7646-7652, https://doi.org/10.1021/jp072167l . [all data]