(CrO3)5 radical anion

Gas phase ion energetics data

Data compiled by: John E. Bartmess

Electron affinity of neutral species

EAneutral (eV) Method Reference Comment
4.80 ± 0.10LPESZhai, Li, et al., 2008Vertical Detachment Energy: 5.17±0.07 eV

References

Zhai, Li, et al., 2008
Zhai, H.J.; Li, S.; Dixon, D.A.; Wang, L.S., Probing the electronic and structural properties of chromium oxide clusters (CrO3)(n)(-) and (CrO3)(n) (n=1-5): Photoelectron Spectroscopy and density functional calculations, J. Am. Chem. Soc., 2008, 130, 15, 5167-5177, https://doi.org/10.1021/ja077984d . [all data]