cC5F8..Br anion

Reaction thermochemistry data

Data compiled by: John E. Bartmess

Individual Reactions

Bromine anion + Cyclopentene, octafluoro- = C5BrF8-

By formula: Br- + C5F8 = C5BrF8-

Quantity Value Units Method Reference Comment
Δr53.1 ± 1.3kJ/molTDAsHiraoka, Fujita, et al., 1905gas phase
Quantity Value Units Method Reference Comment
Δr29.5 ± 1.3kJ/molTDAsHiraoka, Fujita, et al., 1905gas phase

Ion clustering data

Data compiled by: John E. Bartmess

Clustering reactions

Bromine anion + Cyclopentene, octafluoro- = C5BrF8-

By formula: Br- + C5F8 = C5BrF8-

Quantity Value Units Method Reference Comment
Δr12.70 ± 0.30kcal/molTDAsHiraoka, Fujita, et al., 1905gas phase
Quantity Value Units Method Reference Comment
Δr7.04 ± 0.30kcal/molTDAsHiraoka, Fujita, et al., 1905gas phase

References

Hiraoka, Fujita, et al., 1905
Hiraoka, K.; Fujita, K.; Ishida, M.; Ichikawa, T.; Okada, H.; Hiizumi, K.; Wada, A.; Takao, K.; Yamabe, S.; Tsuchida, N., Gas-phase Ion/Molecule Reactions in C5F8, J. Phys. Chem. A (2005), 1905, 109, 6, 1049-1056., https://doi.org/10.1021/jp040251k . [all data]