(cC5F8)2..Cl anion

Ion clustering data

Data compiled by: John E. Bartmess

Clustering reactions

C5ClF8- + 2Cyclopentene, octafluoro- = C10ClF16-

By formula: C5ClF8- + 2C5F8 = C10ClF16-

Quantity Value Units Method Reference Comment
Δr11.00 ± 0.20kcal/molTDAsHiraoka, Fujita, et al., 1905gas phase
Quantity Value Units Method Reference Comment
Δr2.35 ± 0.20kcal/molTDAsHiraoka, Fujita, et al., 1905gas phase

References

Hiraoka, Fujita, et al., 1905
Hiraoka, K.; Fujita, K.; Ishida, M.; Ichikawa, T.; Okada, H.; Hiizumi, K.; Wada, A.; Takao, K.; Yamabe, S.; Tsuchida, N., Gas-phase Ion/Molecule Reactions in C5F8, J. Phys. Chem. A (2005), 1905, 109, 6, 1049-1056., https://doi.org/10.1021/jp040251k . [all data]