CF2=CF2..Br anion

Reaction thermochemistry data

Data compiled by: John E. Bartmess

Individual Reactions

Bromine anion + Ethene, tetrafluoro- = C2BrF4-

By formula: Br- + C2F4 = C2BrF4-

Quantity Value Units Method Reference Comment
Δr7.10 ± 0.50kcal/molTDAsHiraoka, Mochizuki, et al., 2008gas phase; The experimental HOF of C2F4 has been questioned as being too positive: Curtiss, Raghavachari, et al., 7374, 11CHA/DEN
Quantity Value Units Method Reference Comment
Δr2.33 ± 0.50kcal/molTDAsHiraoka, Mochizuki, et al., 2008gas phase; The experimental HOF of C2F4 has been questioned as being too positive: Curtiss, Raghavachari, et al., 7374, 11CHA/DEN

C2BrF4- + 2Ethene, tetrafluoro- = C4BrF8-

By formula: C2BrF4- + 2C2F4 = C4BrF8-

Quantity Value Units Method Reference Comment
Δr6.00 ± 0.50kcal/molTDAsHiraoka, Mochizuki, et al., 2008gas phase
Quantity Value Units Method Reference Comment
Δr0.93 ± 0.50kcal/molTDAsHiraoka, Mochizuki, et al., 2008gas phase

References

Hiraoka, Mochizuki, et al., 2008
Hiraoka, K.; Mochizuki, N.; Wada, A.; Okada, H.; Ichikawa, T.; Asakawa, D.; Yazawa, I., Gas-phase ion/molecule reactions in C2F4, Int. J. Mass Spectrom., 2008, 272, 1, 22-28, https://doi.org/10.1016/j.ijms.2007.12.013 . [all data]

Curtiss, Raghavachari, et al., 7374
Curtiss, L.A.; Raghavachari, K.; Redfern, P.C.; Pople, J.A., Assesment of Gaussian-3 and density Functional Theories for a larger experimental test set, J. Chem. Phys. 112 (2000), 7374. [all data]