succinimidate anion

Reaction thermochemistry data

Data compiled by: John E. Bartmess

Individual Reactions

C4H4NO2- + Hydrogen cation = Succinimide

By formula: C4H4NO2- + H+ = C4H5NO2

Quantity Value Units Method Reference Comment
Δr345.4 ± 2.3kcal/molG+TSCumming and Kebarle, 1978gas phase
Δr329.7 ± 4.6kcal/molEIAECooper and Compton, 1973gas phase
Quantity Value Units Method Reference Comment
Δr338.0 ± 2.0kcal/molIMRECumming and Kebarle, 1978gas phase

Gas phase ion energetics data

Data compiled by: John E. Bartmess

Protonation reactions

C4H4NO2- + Hydrogen cation = Succinimide

By formula: C4H4NO2- + H+ = C4H5NO2

Quantity Value Units Method Reference Comment
Δr345.4 ± 2.3kcal/molG+TSCumming and Kebarle, 1978gas phase
Δr329.7 ± 4.6kcal/molEIAECooper and Compton, 1973gas phase
Quantity Value Units Method Reference Comment
Δr338.0 ± 2.0kcal/molIMRECumming and Kebarle, 1978gas phase

References

Cumming and Kebarle, 1978
Cumming, J.B.; Kebarle, P., Summary of gas phase measurements involving acids AH. Entropy changes in proton transfer reactions involving negative ions. Bond dissociation energies D(A-H) and electron affinities EA(A), Can. J. Chem., 1978, 56, 1. [all data]

Cooper and Compton, 1973
Cooper, C.D.; Compton, R.N., Electron attachment and cesium collisional ionization studies of tetrafluorosuccinic and hexafluoroglutaric anhydrides: Molecular electron affinities, J. Chem. Phys., 1973, 59, 3550. [all data]