(CF2=CF2)4..Cl anion

Reaction thermochemistry data

Data compiled by: John E. Bartmess

Individual Reactions

C6ClF12- + 4Ethene, tetrafluoro- = C8ClF16-

By formula: C6ClF12- + 4C2F4 = C8ClF16-

Quantity Value Units Method Reference Comment
Δr6.00 ± 0.50kcal/molTDAsHiraoka, Mochizuki, et al., 2008gas phase
Quantity Value Units Method Reference Comment
Δr0.04 ± 0.50kcal/molTDAsHiraoka, Mochizuki, et al., 2008gas phase

Ion clustering data

Data compiled by: John E. Bartmess

Clustering reactions

C6ClF12- + 4Ethene, tetrafluoro- = C8ClF16-

By formula: C6ClF12- + 4C2F4 = C8ClF16-

Quantity Value Units Method Reference Comment
Δr6.00 ± 0.50kcal/molTDAsHiraoka, Mochizuki, et al., 2008gas phase
Quantity Value Units Method Reference Comment
Δr0.04 ± 0.50kcal/molTDAsHiraoka, Mochizuki, et al., 2008gas phase

References

Hiraoka, Mochizuki, et al., 2008
Hiraoka, K.; Mochizuki, N.; Wada, A.; Okada, H.; Ichikawa, T.; Asakawa, D.; Yazawa, I., Gas-phase ion/molecule reactions in C2F4, Int. J. Mass Spectrom., 2008, 272, 1, 22-28, https://doi.org/10.1016/j.ijms.2007.12.013 . [all data]