CF3CF=CF2..I anion

Ion clustering data

Data compiled by: John E. Bartmess

Clustering reactions

C3F6I- + 2Propene, hexafluoro- = C6F12I-

By formula: C3F6I- + 2C3F6 = C6F12I-

Quantity Value Units Method Reference Comment
Δr32.2 ± 1.3kJ/molTDAsHiraoka, Takao, et al., 2002gas phase
Quantity Value Units Method Reference Comment
Δr1.0 ± 1.3kJ/molTDAsHiraoka, Takao, et al., 2002gas phase

Iodide + Propene, hexafluoro- = C3F6I-

By formula: I- + C3F6 = C3F6I-

Quantity Value Units Method Reference Comment
Δr36.0 ± 1.3kJ/molTDAsHiraoka, Takao, et al., 2002gas phase
Quantity Value Units Method Reference Comment
Δr6.0 ± 1.3kJ/molTDAsHiraoka, Takao, et al., 2002gas phase

References

Hiraoka, Takao, et al., 2002
Hiraoka, K.; Takao, K.; Lino, T.; Nakagawa, F.; Suyama, H.; Mizuno, T.; Yamabe, S., Gas-phase ion-molecule reactions in C3F6, J. Phys. Chem. A, 2002, 106, 4, 603-611, https://doi.org/10.1021/jp0116306 . [all data]