(CF3CF=CF2)2..Br anion

Reaction thermochemistry data

Data compiled by: John E. Bartmess

Individual Reactions

C3BrF6- + 2Propene, hexafluoro- = C6BrF12-

By formula: C3BrF6- + 2C3F6 = C6BrF12-

Quantity Value Units Method Reference Comment
Δr8.30 ± 0.30kcal/molTDAsHiraoka, Takao, et al., 2002gas phase
Quantity Value Units Method Reference Comment
Δr1.74 ± 0.30kcal/molTDAsHiraoka, Takao, et al., 2002gas phase

References

Hiraoka, Takao, et al., 2002
Hiraoka, K.; Takao, K.; Lino, T.; Nakagawa, F.; Suyama, H.; Mizuno, T.; Yamabe, S., Gas-phase ion-molecule reactions in C3F6, J. Phys. Chem. A, 2002, 106, 4, 603-611, https://doi.org/10.1021/jp0116306 . [all data]