(CF3CF=CF2)3..Cl anion

Reaction thermochemistry data

Data compiled by: John E. Bartmess

Individual Reactions

C6ClF12- + 3Propene, hexafluoro- = C9ClF18-

By formula: C6ClF12- + 3C3F6 = C9ClF18-

Quantity Value Units Method Reference Comment
Δr37.2 ± 1.3kJ/molTDAsHiraoka, Takao, et al., 2002gas phase
Quantity Value Units Method Reference Comment
Δr6.1 ± 1.3kJ/molTDAsHiraoka, Takao, et al., 2002gas phase

References

Hiraoka, Takao, et al., 2002
Hiraoka, K.; Takao, K.; Lino, T.; Nakagawa, F.; Suyama, H.; Mizuno, T.; Yamabe, S., Gas-phase ion-molecule reactions in C3F6, J. Phys. Chem. A, 2002, 106, 4, 603-611, https://doi.org/10.1021/jp0116306 . [all data]