CF3CF=CF2..Cl anion

Reaction thermochemistry data

Data compiled by: John E. Bartmess

Individual Reactions

Chlorine anion + Propene, hexafluoro- = C3ClF6-

By formula: Cl- + C3F6 = C3ClF6-

Quantity Value Units Method Reference Comment
Δr12.60 ± 0.30kcal/molTDAsHiraoka, Takao, et al., 2002gas phase
Quantity Value Units Method Reference Comment
Δr5.15 ± 0.30kcal/molTDAsHiraoka, Takao, et al., 2002gas phase

C3ClF6- + 2Propene, hexafluoro- = C6ClF12-

By formula: C3ClF6- + 2C3F6 = C6ClF12-

Quantity Value Units Method Reference Comment
Δr9.60 ± 0.30kcal/molTDAsHiraoka, Takao, et al., 2002gas phase
Quantity Value Units Method Reference Comment
Δr2.74 ± 0.30kcal/molTDAsHiraoka, Takao, et al., 2002gas phase

Ion clustering data

Data compiled by: John E. Bartmess

Clustering reactions

C3ClF6- + 2Propene, hexafluoro- = C6ClF12-

By formula: C3ClF6- + 2C3F6 = C6ClF12-

Quantity Value Units Method Reference Comment
Δr9.60 ± 0.30kcal/molTDAsHiraoka, Takao, et al., 2002gas phase
Quantity Value Units Method Reference Comment
Δr2.74 ± 0.30kcal/molTDAsHiraoka, Takao, et al., 2002gas phase

Chlorine anion + Propene, hexafluoro- = C3ClF6-

By formula: Cl- + C3F6 = C3ClF6-

Quantity Value Units Method Reference Comment
Δr12.60 ± 0.30kcal/molTDAsHiraoka, Takao, et al., 2002gas phase
Quantity Value Units Method Reference Comment
Δr5.15 ± 0.30kcal/molTDAsHiraoka, Takao, et al., 2002gas phase

References

Hiraoka, Takao, et al., 2002
Hiraoka, K.; Takao, K.; Lino, T.; Nakagawa, F.; Suyama, H.; Mizuno, T.; Yamabe, S., Gas-phase ion-molecule reactions in C3F6, J. Phys. Chem. A, 2002, 106, 4, 603-611, https://doi.org/10.1021/jp0116306 . [all data]