Nb2C5 anion

Gas phase ion energetics data

Data compiled by: John E. Bartmess

Electron affinity of neutral species

EAneutral (eV) Method Reference Comment
2.13 ± 0.13LPESKnappenberger, Clayborne, et al., 2007Stated electron affinity is the Vertical Detachment Energy

References

Knappenberger, Clayborne, et al., 2007
Knappenberger, K.L.; Clayborne, P.A.; Reveles, J.U.; Sobhy, M.A.; Jones, C.E.; Gupta, U.U.; Khanna, S.N.; Iordanov, I.; Sofo, J.; Castleman, A.W., Anion photoelectron spectroscopy and density functional investigation of diniobium-carbon clusters, Acs Nano, 2007, 1, 4, 319-326, https://doi.org/10.1021/nn700167c . [all data]